Reaction Details
TargetCoagulation factor X
LigandBDBM50111960
Substrate/Competitorn/a
Meas. Tech.ChEBML_49330
Ki 120±n/a nM
Citation He, WHanney, BMyers, MRCondon, SBecker, MRSpada, APBurns, CBrown, KColussi, DChu, V Benzimidazoles and isosteric compounds as potent and selective factor Xa inhibitors. Bioorg Med Chem Lett12:919-22 (2002) Coagulation factor X
Name:Coagulation factor X
Type:Enzyme
Mol. Mass.:54726.60
Organism:Homo sapiens (Human)
Description:n/a
Residue:488
BDBM50111960
NameBDBM50111960
Synonyms:1-(4-Amino-quinazolin-7-ylmethyl)-4-(6-methyl-1H-benzoimidazol-2-ylmethyl)-piperazin-2-one | CHEMBL354154
TypeSmall organic molecule
Emp. Form.C22H23N7O
Mol. Mass.401.4643
SMILESCc1ccc2nc(CN3CCN(Cc4ccc5c(N)ncnc5c4)C(=O)C3)[nH]c2c1