Reaction Details
TargetCoagulation factor X
LigandBDBM50111964
Substrate/Competitorn/a
Meas. Tech.ChEBML_49330
Ki 1200±n/a nM
Citation He, WHanney, BMyers, MRCondon, SBecker, MRSpada, APBurns, CBrown, KColussi, DChu, V Benzimidazoles and isosteric compounds as potent and selective factor Xa inhibitors. Bioorg Med Chem Lett12:919-22 (2002) Coagulation factor X
Name:Coagulation factor X
Type:Enzyme
Mol. Mass.:54726.60
Organism:Homo sapiens (Human)
Description:n/a
Residue:488
BDBM50111964
NameBDBM50111964
Synonyms:1-(4-Amino-quinazolin-7-ylmethyl)-4-(1H-benzoimidazol-2-ylmethyl)-piperazin-2-one | CHEMBL170093
TypeSmall organic molecule
Emp. Form.C21H21N7O
Mol. Mass.387.4377
SMILESNc1ncnc2cc(CN3CCN(Cc4nc5ccccc5[nH]4)CC3=O)ccc12