Reaction Details
TargetCoagulation factor X
LigandBDBM50111963
Substrate/Competitorn/a
Meas. Tech.ChEBML_49330
Ki 17±n/a nM
Citation He, WHanney, BMyers, MRCondon, SBecker, MRSpada, APBurns, CBrown, KColussi, DChu, V Benzimidazoles and isosteric compounds as potent and selective factor Xa inhibitors. Bioorg Med Chem Lett12:919-22 (2002) Coagulation factor X
Name:Coagulation factor X
Type:Enzyme
Mol. Mass.:54726.60
Organism:Homo sapiens (Human)
Description:n/a
Residue:488
BDBM50111963
NameBDBM50111963
Synonyms:1-(4-Amino-quinazolin-7-ylmethyl)-4-(6-bromo-1H-benzoimidazol-2-ylmethyl)-piperazin-2-one | CHEMBL173333
TypeSmall organic molecule
Emp. Form.C21H20BrN7O
Mol. Mass.466.334
SMILESNc1ncnc2cc(CN3CCN(Cc4nc5ccc(Br)cc5[nH]4)CC3=O)ccc12