Reaction Details
TargetCoagulation factor X
LigandBDBM50111965
Substrate/Competitorn/a
Meas. Tech.ChEBML_49330
Ki 40±n/a nM
Citation He, WHanney, BMyers, MRCondon, SBecker, MRSpada, APBurns, CBrown, KColussi, DChu, V Benzimidazoles and isosteric compounds as potent and selective factor Xa inhibitors. Bioorg Med Chem Lett12:919-22 (2002) Coagulation factor X
Name:Coagulation factor X
Type:Enzyme
Mol. Mass.:54726.60
Organism:Homo sapiens (Human)
Description:n/a
Residue:488
BDBM50111965
NameBDBM50111965
Synonyms:4-[4-(6-Chloro-1H-benzoimidazol-2-ylmethyl)-2-oxo-piperazin-1-ylmethyl]-benzamidine | CHEMBL367731
TypeSmall organic molecule
Emp. Form.C20H21ClN6O
Mol. Mass.396.873
SMILESNC(=N)c1ccc(CN2CCN(Cc3nc4ccc(Cl)cc4[nH]3)CC2=O)cc1