Reaction Details
TargetHistamine H3 receptor
LigandBDBM50071492
Substrate/Competitorn/a
Meas. Tech.ChEBML_85849
Ki 16±n/a nM
Citation Aslanian, RMutahi, MWShih, NYMcCormick, KDPiwinski, JJTing, PCAlbanese, MMBerlin, MYZhu, XWong, SCRosenblum, SBJiang, YWest, RShe, SWilliams, SMBryant, MHey, JA Identification of a novel, orally bioavailable histamine H(3) receptor antagonist based on the 4-benzyl-(1H-imidazol-4-yl) template. Bioorg Med Chem Lett12:937-41 (2002) Histamine H3 receptor
Name:Histamine H3 receptor
Type:Enzyme Catalytic Domain
Mol. Mass.:48753.61
Organism:GUINEA PIG
Description:HISTAMINE H3 HRH3 GUINEA PIG::Q9JI35
Residue:445
BDBM50071492
NameBDBM50071492
Synonyms:CHEMBL312341 | N-(4-Chloro-benzyl)-4-(1H-imidazol-4-ylmethyl)-benzamidine
TypeSmall organic molecule
Emp. Form.C18H17ClN4
Mol. Mass.324.807
SMILESNC(=NCc1ccc(Cl)cc1)c1ccc(Cc2cnc[nH]2)cc1