Reaction Details
TargetPlasminogen
LigandBDBM50112086
Substrate/Competitorn/a
Meas. Tech.ChEMBL_222780 (CHEMBL847109)
Ki 1695±n/a nM
Citation Hauel, NHNar, HPriepke, HRies, UStassen, JMWienen, W Structure-based design of novel potent nonpeptide thrombin inhibitors. J Med Chem45:1757-66 (2002) Plasminogen
Name:Plasminogen
Type:Enzyme
Mol. Mass.:90579.18
Organism:Homo sapiens (Human)
Description:n/a
Residue:810
BDBM50112086
NameBDBM50112086
Synonyms:3-({2-[(4-Carbamimidoyl-phenylamino)-methyl]-1-methyl-1H-benzoimidazole-5-carbonyl}-pyridin-2-yl-amino)-propionic acid DABIGATRAN
TypeSmall organic molecule
Emp. Form.C25H25N7O3
Mol. Mass.471.5111
SMILESCn1c(CNc2ccc(cc2)C(N)=N)nc2cc(ccc12)C(=O)N(CCC(O)=O)c1ccccn1