Reaction Details
TargetAdenosine receptor A1
LigandBDBM50112189
Substrate/Competitorn/a
Meas. Tech.ChEMBL_29610 (CHEMBL642892)
Ki 6.4±n/a nM
Citation Van Calenbergh, SLink, AFujikawa, Sde Ligt, RAVanheusden, VGolisade, ABlaton, NMRozenski, JIJzerman, APHerdewijn, P 5'-Deoxy congeners of 9-(3-amido-3-deoxy-beta-D-xylofuranosyl)-N(6)-cyclopentyladenine: new adenosine A(1) receptor antagonists and inverse agonists. J Med Chem45:1845-52 (2002) Adenosine receptor A1
Name:Adenosine receptor A1
Type:Protein
Mol. Mass.:36704.13
Organism:Rattus norvegicus (rat)
Description:n/a
Residue:326
BDBM50112189
NameBDBM50112189
Synonyms:2-(6-Cyclopentylamino-purin-9-yl)-5-methyl-tetrahydro-furan-3,4-diol | CHEMBL54468
TypeSmall organic molecule
Emp. Form.C15H21N5O3
Mol. Mass.319.3589
SMILESC[C@H]1O[C@H]([C@H](O)[C@H]1O)n1cnc2c(NC3CCCC3)ncnc12