Reaction Details
TargetRibosyldihydronicotinamide dehydrogenase [quinone]
LigandBDBM50066960
Substrate/Competitorn/a
Meas. Tech.ChEMBL_104942 (CHEMBL713109)
Ki 2.8±n/a nM
Citation Leclerc, VYous, SDelagrange, PBoutin, JARenard, PLesieur, D Synthesis of nitroindole derivatives with high affinity and selectivity for melatoninergic binding sites MT(3). J Med Chem45:1853-9 (2002) Ribosyldihydronicotinamide dehydrogenase [quinone]
Name:Ribosyldihydronicotinamide dehydrogenase [quinone]
Type:Protein
Mol. Mass.:25917.25
Organism:Homo sapiens (Human)
Description:P16083
Residue:231
BDBM50066960
NameBDBM50066960
Synonyms:CHEMBL33700 N-[2-(5-Methoxy-1-methyl-1H-indol-3-yl)-ethyl]-acetamide
TypeSmall organic molecule
Emp. Form.C14H18N2O2
Mol. Mass.246.3049
SMILESCOc1ccc2n(C)cc(CCNC(C)=O)c2c1