Reaction Details
TargetMelatonin receptor type 1B
LigandBDBM50112205
Substrate/Competitorn/a
Meas. Tech.ChEMBL_105404 (CHEMBL710823)
Ki 5.3±n/a nM
Citation Leclerc, VYous, SDelagrange, PBoutin, JARenard, PLesieur, D Synthesis of nitroindole derivatives with high affinity and selectivity for melatoninergic binding sites MT(3). J Med Chem45:1853-9 (2002) Melatonin receptor type 1B
Name:Melatonin receptor type 1B
Type:Enzyme
Mol. Mass.:40203.54
Organism:Homo sapiens (Human)
Description:P49286
Residue:362
BDBM50112205
NameBDBM50112205
Synonyms:CHEMBL298335 | N-[2-(5-Methoxy-6-nitro-1H-indol-3-yl)-ethyl]-acetamide
TypeSmall organic molecule
Emp. Form.C13H15N3O4
Mol. Mass.277.2759
SMILESCOc1cc2c(CCNC(C)=O)c[nH]c2cc1[N+]([O-])=O