Reaction Details
TargetMelatonin receptor type 1A
LigandBDBM9019
Substrate/Competitorn/a
Meas. Tech.ChEMBL_104950 (CHEMBL713259)
Ki 0.120000±n/a nM
Citation Leclerc, VYous, SDelagrange, PBoutin, JARenard, PLesieur, D Synthesis of nitroindole derivatives with high affinity and selectivity for melatoninergic binding sites MT(3). J Med Chem45:1853-9 (2002) Melatonin receptor type 1A
Name:Melatonin receptor type 1A
Type:Enzyme
Mol. Mass.:39392.94
Organism:Homo sapiens (Human)
Description:P48039
Residue:350
BDBM9019
NameBDBM9019
Synonyms:CHEMBL45 N-[2-(5-methoxy-1H-indol-3-yl)ethyl]acetamide
TypeSmall organic molecule
Emp. Form.C13H16N2O2
Mol. Mass.232.2783
SMILESCOc1ccc2[nH]cc(CCNC(C)=O)c2c1