Reaction Details
TargetMelatonin receptor type 1A
LigandBDBM50066960
Substrate/Competitorn/a
Meas. Tech.ChEMBL_104950 (CHEMBL713259)
Ki 2.6±n/a nM
Citation Leclerc, VYous, SDelagrange, PBoutin, JARenard, PLesieur, D Synthesis of nitroindole derivatives with high affinity and selectivity for melatoninergic binding sites MT(3). J Med Chem45:1853-9 (2002) Melatonin receptor type 1A
Name:Melatonin receptor type 1A
Type:Enzyme
Mol. Mass.:39392.94
Organism:Homo sapiens (Human)
Description:P48039
Residue:350
BDBM50066960
NameBDBM50066960
Synonyms:CHEMBL33700 N-[2-(5-Methoxy-1-methyl-1H-indol-3-yl)-ethyl]-acetamide
TypeSmall organic molecule
Emp. Form.C14H18N2O2
Mol. Mass.246.3049
SMILESCOc1ccc2n(C)cc(CCNC(C)=O)c2c1