Reaction Details
TargetMelatonin receptor type 1A
LigandBDBM50112205
Substrate/Competitorn/a
Meas. Tech.ChEMBL_104950 (CHEMBL713259)
Ki 15±n/a nM
Citation Leclerc, VYous, SDelagrange, PBoutin, JARenard, PLesieur, D Synthesis of nitroindole derivatives with high affinity and selectivity for melatoninergic binding sites MT(3). J Med Chem45:1853-9 (2002) Melatonin receptor type 1A
Name:Melatonin receptor type 1A
Type:Enzyme
Mol. Mass.:39392.94
Organism:Homo sapiens (Human)
Description:P48039
Residue:350
BDBM50112205
NameBDBM50112205
Synonyms:CHEMBL298335 | N-[2-(5-Methoxy-6-nitro-1H-indol-3-yl)-ethyl]-acetamide
TypeSmall organic molecule
Emp. Form.C13H15N3O4
Mol. Mass.277.2759
SMILESCOc1cc2c(CCNC(C)=O)c[nH]c2cc1[N+]([O-])=O