Reaction Details
TargetAlbumin
LigandBDBM50112215
Substrate/Competitorn/a
Meas. Tech.ChEMBL_200909 (CHEMBL880920)
IC50 1200000±n/a nM
Citation Eckenhoff, RGKnoll, FJGreenblatt, EPDailey, WP Halogenated diazirines as photolabel mimics of the inhaled haloalkane anesthetics. J Med Chem45:1879-86 (2002) Albumin
Name:Albumin
Type:PROTEIN
Mol. Mass.:69362.94
Organism:Homo sapiens (Human)
Description:ChEMBL_1509401
Residue:609
BDBM50112215
NameBDBM50112215
Synonyms:2-Diazo-1,1,1-trifluoro-ethane | CHEMBL54683
TypeSmall organic molecule
Emp. Form.C2HF3N2
Mol. Mass.110.0379
SMILESFC(F)(F)[CH-][N+]#N