Reaction Details
TargetGamma-aminobutyric acid receptor subunit alpha-3/beta-3/gamma-2
LigandBDBM50007664
Substrate/Competitorn/a
Meas. Tech.ChEMBL_70417 (CHEMBL682252)
Ki 275±n/a nM
Citation Collins, IMoyes, CDavey, WBRowley, MBromidge, FAQuirk, KAtack, JRMcKernan, RMThompson, SAWafford, KDawson, GRPike, ASohal, BTsou, NNBall, RGCastro, JL 3-Heteroaryl-2-pyridones: benzodiazepine site ligands with functional delectivity for alpha 2/alpha 3-subtypes of human GABA(A) receptor-ion channels. J Med Chem45:1887-900 (2002) Gamma-aminobutyric acid receptor subunit alpha-3/beta-3/gamma-2
Name:Gamma-aminobutyric acid receptor subunit alpha-3/beta-3/gamma-2
Type:n/a
Mol. Mass.:n/a
Description:ASSAY_ID of EBI is 68410
Components:This complex has 3 components.
Component 1
Name:Gamma-aminobutyric acid receptor subunit gamma-2
Synonyms:GABA(A) receptor subunit gamma-2 GBRG2_HUMAN
Type:PROTEIN
Mol. Mass.:54172.74
Organism:Homo sapiens (Human)
Description:EBI_217
Residue:467
Component 2
Name:Gamma-aminobutyric acid receptor subunit beta-3
Synonyms:GABA A receptor alpha-4/beta-3/gamma-2 GABA-A receptor GBRB3_HUMAN | agonist GABA site
Type:PROTEIN
Mol. Mass.:54130.51
Organism:Homo sapiens (Human)
Description:ChEMBL_448071
Residue:473
Component 3
Name:Gamma-aminobutyric acid receptor subunit alpha-3
Synonyms:GABA A Alpha3Beta3Gamma2 GABA C GABA-A receptor GBRA3_HUMAN agonist GABA site
Type:Enzyme Catalytic Domain
Mol. Mass.:55175.47
Organism:Homo sapiens (Human)
Description:GABA A Alpha3Beta1Gamma2 0 HUMAN::P34903
Residue:492
BDBM50007664
NameBDBM50007664
Synonyms:7-chloro-2-methylamino-5-phenyl-3H-1,4-benzodiazepin-4-oxide CDP CHLORDIAZEPOXIDE methaminodiazepoxide
TypeSmall organic molecule
Emp. Form.C16H14ClN3O
Mol. Mass.299.755
SMILESCNC1=Nc2ccc(Cl)cc2C(c2ccccc2)=[N+]([O-])C1