Reaction Details
TargetGeranylgeranyl transferase type-1 subunit beta/Protein farnesyltransferase/geranylgeranyltransferase type-1 subunit alpha
LigandBDBM50112372
Substrate/Competitorn/a
Meas. Tech.ChEMBL_71822 (CHEMBL683653)
IC50 4.8±n/a nM
Citation Nguyen, DNStump, CAWalsh, ESFernandes, CDavide, JPEllis-Hutchings, MRobinson, RGWilliams, TMLobell, RBHuber, HEBuser, CA Potent inhibitors of farnesyltransferase and geranylgeranyltransferase-I. Bioorg Med Chem Lett12:1269-73 (2002) Geranylgeranyl transferase type-1 subunit beta/Protein farnesyltransferase/geranylgeranyltransferase type-1 subunit alpha
Name:Geranylgeranyl transferase type-1 subunit beta/Protein farnesyltransferase/geranylgeranyltransferase type-1 subunit alpha
Type:n/a
Mol. Mass.:n/a
Description:ASSAY_ID of EBI is 70196
Components:This complex has 2 components.
Component 1
Name:Protein farnesyltransferase/geranylgeranyltransferase type-1 subunit alpha
Synonyms:CAAX farnesyltransferase alpha subunit FNTA_HUMAN FTase-alpha Geranylgeranyl Transferase (GGTase-I) Chain A Protein Farnesyltransferase (PFT) Chain A Protein farnesyltransferase Protein farnesyltransferase/geranylgeranyltransferase type I alpha subunit | Ras proteins prenyltransferase alpha
Type:Enzyme
Mol. Mass.:44392.46
Organism:Homo sapiens (Human)
Description:Recombinant human FTase.
Residue:379
Component 2
Name:Geranylgeranyl transferase type-1 subunit beta
Synonyms:2.5.1.59 Geranylgeranyl transferase type I Geranylgeranyl transferase type I subunit beta PGGT1B Protein farnesyl/geranylgeranyl transferase | Type I protein geranyl-geranyltransferase subunit beta
Type:n/a
Mol. Mass.:42369.84
Organism:Homo sapiens (Human)
Description:n/a
Residue:377
BDBM50112372
NameBDBM50112372
Synonyms:17-(5,5,5-trifluoro-1-pentynyl)-19-oxa-2,5,10,12-tetraazahexacyclo[18.6.2.22,5.114,18.08,12.023,27]hentriaconta-1(27),8,10,14(31),15,17,20(28),21,23,25-decaen-3-one | CHEMBL283369
TypeSmall organic molecule
Emp. Form.C31H27F3N4O2
Mol. Mass.544.5669
SMILESFC(F)(F)CCC#Cc1ccc2Cn3cncc3CCN3CCN(C(=O)C3)c3cccc4ccc(Oc1c2)cc34