Reaction Details
TargetProtein farnesyltransferase subunit beta/geranylgeranyltransferase type-1 subunit alpha
LigandBDBM50112385
Substrate/Competitorn/a
Meas. Tech.ChEMBL_70268 (CHEMBL681407)
IC50 35±n/a nM
Citation Nguyen, DNStump, CAWalsh, ESFernandes, CDavide, JPEllis-Hutchings, MRobinson, RGWilliams, TMLobell, RBHuber, HEBuser, CA Potent inhibitors of farnesyltransferase and geranylgeranyltransferase-I. Bioorg Med Chem Lett12:1269-73 (2002) Protein farnesyltransferase subunit beta/geranylgeranyltransferase type-1 subunit alpha
Name:Protein farnesyltransferase subunit beta/geranylgeranyltransferase type-1 subunit alpha
Type:Protein Complex
Mol. Mass.:n/a
Description:Purified bovine brain FTase.
Components:This complex has 2 components.
Component 1
Name:Protein farnesyltransferase/geranylgeranyltransferase type-1 subunit alpha
Synonyms:CAAX farnesyltransferase alpha subunit FNTA_BOVIN GGTase-I-alpha Protein Farnesyltransferase (PFT) Chain A Protein farnesyltransferase/geranylgeranyltransferase type I alpha subunit Type I protein geranyl-geranyltransferase alpha subunit
Type:Enzyme
Mol. Mass.:43827.38
Organism:Bos taurus (bovine)
Description:The enzyme was purified from a bovine brain homogenate by sequential ammonium sulfate fractionation and affinity chromatography.
Residue:375
Component 2
Name:Protein farnesyltransferase subunit beta
Synonyms:CAAX farnesyltransferase subunit beta FNTB_BOVIN Protein farnesyltransferase Protein farnesyltransferase subunit beta Ras proteins prenyltransferase subunit beta
Type:Enzyme Subunit
Mol. Mass.:48758.49
Organism:Bos taurus (bovine)
Description:Protein farnesyltransferase subunit beta
Residue:437
BDBM50112385
NameBDBM50112385
Synonyms:1-(3-Chloro-phenyl)-4-[3-(3',5'-dichloro-biphenyl-4-ylmethyl)-3H-imidazol-4-ylmethyl]-piperazin-2-one | CHEMBL283542
TypeSmall organic molecule
Emp. Form.C27H23Cl3N4O
Mol. Mass.525.857
SMILESClc1cccc(c1)N1CCN(Cc2cncn2Cc2ccc(cc2)-c2cc(Cl)cc(Cl)c2)CC1=O