Reaction Details
TargetEstrogen receptor
LigandBDBM20607
Substrate/Competitorn/a
Meas. Tech.ChEBML_67666
IC50 8.4±n/a nM
Citation Adamczyk, MReddy, REYu, Z Synthesis of a novel fluorescent probe for estrogen receptor. Bioorg Med Chem Lett12:1283-5 (2002) Estrogen receptor
Name:Estrogen receptor
Type:Protein
Mol. Mass.:66230.44
Organism:Homo sapiens (Human)
Description:P03372
Residue:595
BDBM20607
NameBDBM20607
Synonyms:(2-{4-[(1Z)-1,2-diphenylbut-1-en-1-yl]phenoxy}ethyl)dimethylamine CHEMBL83 NCGC00024928 Tamoxifen Tamoxifen, 7 med.21724, Compound Tamoxifen
TypeSmall organic molecule
Emp. Form.C26H29NO
Mol. Mass.371.5146
SMILESCC\C(=C(/c1ccccc1)c1ccc(OCCN(C)C)cc1)c1ccccc1