Reaction Details
TargetCoagulation factor X
LigandBDBM50112488
Substrate/Competitorn/a
Meas. Tech.ChEBML_49302
Ki 0.270000±n/a nM
Citation Wu, SGuilford, WJChou, YLGriedel, BDLiang, ASakata, SShaw, KJTrinh, LXu, WZhao, ZMorrissey, MM Design and synthesis of aminophenol-based factor Xa inhibitors. Bioorg Med Chem Lett12:1307-10 (2002) Coagulation factor X
Name:Coagulation factor X
Type:Enzyme
Mol. Mass.:54726.60
Organism:Homo sapiens (Human)
Description:n/a
Residue:488
BDBM50112488
NameBDBM50112488
Synonyms:3-(3-{4-[1-(1-Imino-ethyl)-piperidin-4-yloxy]-3-nitro-phenylamino}-propenyl)-benzamidine | CHEMBL24630
TypeSmall organic molecule
Emp. Form.C23H28N6O3
Mol. Mass.436.5068
SMILESCC([NH-])=[N+]1CCC(CC1)Oc1ccc(NC\C=C\c2cccc(c2)C(N)=N)cc1[N+]([O-])=O