Reaction Details
TargetCoagulation factor X
LigandBDBM50112502
Substrate/Competitorn/a
Meas. Tech.ChEBML_49302
Ki 0.070000±n/a nM
Citation Wu, SGuilford, WJChou, YLGriedel, BDLiang, ASakata, SShaw, KJTrinh, LXu, WZhao, ZMorrissey, MM Design and synthesis of aminophenol-based factor Xa inhibitors. Bioorg Med Chem Lett12:1307-10 (2002) Coagulation factor X
Name:Coagulation factor X
Type:Enzyme
Mol. Mass.:54726.60
Organism:Homo sapiens (Human)
Description:n/a
Residue:488
BDBM50112502
NameBDBM50112502
Synonyms:CHEMBL26299 | N-[3-(5-Carbamimidoyl-2-hydroxy-phenyl)-allyl]-N-{4-[1-(1-imino-ethyl)-piperidin-4-yloxy]-3-trifluoromethyl-phenyl}-succinamic acid ethyl ester
TypeSmall organic molecule
Emp. Form.C30H36F3N5O5
Mol. Mass.603.6325
SMILESCCOC(=O)CCC(=O)N(CC=Cc1cc(ccc1O)C(N)=N)c1ccc(OC2CCN(CC2)C(C)=N)c(c1)C(F)(F)F