Reaction Details
TargetTyrosine-protein kinase Lck
LigandBDBM50112919
Substrate/Competitorn/a
Meas. Tech.ChEBML_221484
IC50 50±n/a nM
Citation Chen, PNorris, DIwanowicz, EJSpergel, SHLin, JGu, HHShen, ZWityak, JLin, TAPang, SDe Fex, HFPitt, SShen, DRDoweyko, AMBassolino, DARoberge, JYPoss, MAChen, BCSchieven, GLBarrish, JC Discovery and initial SAR of imidazoquinoxalines as inhibitors of the Src-family kinase p56(Lck). Bioorg Med Chem Lett12:1361-4 (2002) Tyrosine-protein kinase Lck
Name:Tyrosine-protein kinase Lck
Type:n/a
Mol. Mass.:57987.83
Organism:Homo sapiens (Human)
Description:P06239
Residue:509
BDBM50112919
NameBDBM50112919
Synonyms:(2,6-Dibromo-phenyl)-imidazo[1,5-a]quinoxalin-4-yl-amine N-(2,6-dibromophenyl)imidazo[1,5-a]quinoxalin-4-amine
TypeSmall organic molecule
Emp. Form.C16H10Br2N4
Mol. Mass.418.085
SMILESBrc1cccc(Br)c1Nc1nc2ccccc2n2cncc12