Reaction Details
TargetTyrosine-protein kinase Lck
LigandBDBM50112934
Substrate/Competitorn/a
Meas. Tech.ChEBML_221484
IC50 30±n/a nM
Citation Chen, PNorris, DIwanowicz, EJSpergel, SHLin, JGu, HHShen, ZWityak, JLin, TAPang, SDe Fex, HFPitt, SShen, DRDoweyko, AMBassolino, DARoberge, JYPoss, MAChen, BCSchieven, GLBarrish, JC Discovery and initial SAR of imidazoquinoxalines as inhibitors of the Src-family kinase p56(Lck). Bioorg Med Chem Lett12:1361-4 (2002) Tyrosine-protein kinase Lck
Name:Tyrosine-protein kinase Lck
Type:n/a
Mol. Mass.:57987.83
Organism:Homo sapiens (Human)
Description:P06239
Residue:509
BDBM50112934
NameBDBM50112934
Synonyms:(2-Chloro-phenyl)-(3-methyl-imidazo[1,5-a]quinoxalin-4-yl)-amine N-(2-chlorophenyl)-3-methylimidazo[1,5-a]quinoxalin-4-amine
TypeSmall organic molecule
Emp. Form.C17H13ClN4
Mol. Mass.308.765
SMILESCc1ncn2c1c(Nc1ccccc1Cl)nc1ccccc21