Reaction Details
TargetTyrosine-protein kinase Lck
LigandBDBM50112935
Substrate/Competitorn/a
Meas. Tech.ChEBML_221484
IC50 30±n/a nM
Citation Chen, PNorris, DIwanowicz, EJSpergel, SHLin, JGu, HHShen, ZWityak, JLin, TAPang, SDe Fex, HFPitt, SShen, DRDoweyko, AMBassolino, DARoberge, JYPoss, MAChen, BCSchieven, GLBarrish, JC Discovery and initial SAR of imidazoquinoxalines as inhibitors of the Src-family kinase p56(Lck). Bioorg Med Chem Lett12:1361-4 (2002) Tyrosine-protein kinase Lck
Name:Tyrosine-protein kinase Lck
Type:n/a
Mol. Mass.:57987.83
Organism:Homo sapiens (Human)
Description:P06239
Residue:509
BDBM50112935
NameBDBM50112935
Synonyms:(2-Chloro-4,6-dimethyl-phenyl)-imidazo[1,5-a]quinoxalin-4-yl-amine N-(2-chloro-4,6-dimethylphenyl)imidazo[1,5-a]quinoxalin-4-amine
TypeSmall organic molecule
Emp. Form.C18H15ClN4
Mol. Mass.322.792
SMILESCc1cc(C)c(Nc2nc3ccccc3n3cncc23)c(Cl)c1