Reaction Details
TargetTyrosine-protein kinase Lck
LigandBDBM50112948
Substrate/Competitorn/a
Meas. Tech.ChEBML_221484
IC50 6.2±n/a nM
Citation Chen, PNorris, DIwanowicz, EJSpergel, SHLin, JGu, HHShen, ZWityak, JLin, TAPang, SDe Fex, HFPitt, SShen, DRDoweyko, AMBassolino, DARoberge, JYPoss, MAChen, BCSchieven, GLBarrish, JC Discovery and initial SAR of imidazoquinoxalines as inhibitors of the Src-family kinase p56(Lck). Bioorg Med Chem Lett12:1361-4 (2002) Tyrosine-protein kinase Lck
Name:Tyrosine-protein kinase Lck
Type:n/a
Mol. Mass.:57987.83
Organism:Homo sapiens (Human)
Description:P06239
Residue:509
BDBM50112948
NameBDBM50112948
Synonyms:(4-(2-chloro-6-methylphenylamino)-6,7-dimethoxyimidazo[1,5-a]quinoxalin-1-yl)methanol [4-(2-Chloro-6-methyl-phenylamino)-6,7-dimethoxy-imidazo[1,5-a]quinoxalin-1-yl]-methanol
TypeSmall organic molecule
Emp. Form.C20H19ClN4O3
Mol. Mass.398.843
SMILESCOc1ccc2c(nc(Nc3c(C)cccc3Cl)c3cnc(CO)n23)c1OC