Reaction Details
TargetInterstitial collagenase
LigandBDBM50113029
Substrate/Competitorn/a
Meas. Tech.ChEBML_105983
IC50 8.5±n/a nM
Citation Letavic, MAAxt, MZBarberia, JTCarty, TJDanley, DEGeoghegan, KFHalim, NSHoth, LRKamath, AVLaird, ERLopresti-Morrow, LLMcClure, KFMitchell, PGNatarajan, VNoe, MCPandit, JReeves, LSchulte, GKSnow, SLSweeney, FJTan, DHYu, CH Synthesis and biological activity of selective pipecolic acid-based TNF-alpha converting enzyme (TACE) inhibitors. Bioorg Med Chem Lett12:1387-90 (2002) Interstitial collagenase
Name:Interstitial collagenase
Type:Enzyme
Mol. Mass.:54010.26
Organism:Homo sapiens (Human)
Description: P03956
Residue:469
BDBM50113029
NameBDBM50113029
Synonyms:(2R,4R)-1-[4-(4-Fluoro-phenoxy)-benzenesulfonyl]-2-hydroxycarbamoyl-piperidine-4-carboxylic acid methyl ester | CHEMBL286772
TypeSmall organic molecule
Emp. Form.C20H21FN2O7S
Mol. Mass.452.453
SMILESCOC(=O)[C@@H]1CCN([C@H](C1)C(=O)NO)S(=O)(=O)c1ccc(Oc2ccc(F)cc2)cc1