Reaction Details
TargetDisintegrin and metalloproteinase domain-containing protein 17
LigandBDBM50113048
Substrate/Competitorn/a
Meas. Tech.ChEMBL_212741 (CHEMBL816559)
IC50 7±n/a nM
Citation Letavic, MAAxt, MZBarberia, JTCarty, TJDanley, DEGeoghegan, KFHalim, NSHoth, LRKamath, AVLaird, ERLopresti-Morrow, LLMcClure, KFMitchell, PGNatarajan, VNoe, MCPandit, JReeves, LSchulte, GKSnow, SLSweeney, FJTan, DHYu, CH Synthesis and biological activity of selective pipecolic acid-based TNF-alpha converting enzyme (TACE) inhibitors. Bioorg Med Chem Lett12:1387-90 (2002) Disintegrin and metalloproteinase domain-containing protein 17
Name:Disintegrin and metalloproteinase domain-containing protein 17
Type:Enzyme
Mol. Mass.:93007.89
Organism:Homo sapiens (Human)
Description:
Residue:824
BDBM50113048
NameBDBM50113048
Synonyms:(2R,5R)-1-(4-Benzyloxy-benzenesulfonyl)-5-hydroxy-piperidine-2-carboxylic acid hydroxyamide | CHEMBL29007
TypeSmall organic molecule
Emp. Form.C19H22N2O6S
Mol. Mass.406.453
SMILESONC(=O)[C@H]1CC[C@@H](O)CN1S(=O)(=O)c1ccc(OCc2ccccc2)cc1