Reaction Details
TargetPeptidyl-prolyl cis-trans isomerase FKBP1A
LigandBDBM23334
Substrate/Competitorn/a
Meas. Tech.ChEBML_66267
Ki 0.010000±n/a nM
Citation Wei, LWu, YWilkinson, DEChen, YSoni, RScott, CRoss, DTGuo, HHoworth, PValentine, HLiang, SSpicer, DFuller, MSteiner, JHamilton, GS Solid-phase synthesis of FKBP12 inhibitors: N-sulfonyl and N-carbamoylprolyl/pipecolyl amides. Bioorg Med Chem Lett12:1429-33 (2002) Peptidyl-prolyl cis-trans isomerase FKBP1A
Name:Peptidyl-prolyl cis-trans isomerase FKBP1A
Type:Isomerase
Mol. Mass.:11953.09
Organism:Homo sapiens (Human)
Description:P62942
Residue:108
BDBM23334
NameBDBM23334
Synonyms:3-(pyridin-3-yl)propyl (2S)-1-(3,3-dimethyl-2-oxopentanoyl)pyrrolidine-2-carboxylate GPI 1046
TypeSmall organic molecule
Emp. Form.C20H28N2O4
Mol. Mass.360.4473
SMILESCCC(C)(C)C(=O)C(=O)N1CCC[C@H]1C(=O)OCCCc1cccnc1