Reaction Details
TargetGeranylgeranyl pyrophosphate synthase
LigandBDBM50113286
Substrate/Competitorn/a
Meas. Tech.ChEMBL_71679 (CHEMBL681671)
IC50 1400±n/a nM
Citation Szabo, CMMatsumura, YFukura, SMartin, MBSanders, JMSengupta, SCieslak, JALoftus, TCLea, CRLee, HJKoohang, ACoates, RMSagami, HOldfield, E Inhibition of geranylgeranyl diphosphate synthase by bisphosphonates and diphosphates: a potential route to new bone antiresorption and antiparasitic agents. J Med Chem45:2185-96 (2002) Geranylgeranyl pyrophosphate synthase
Name:Geranylgeranyl pyrophosphate synthase
Type:Homooctamer; transferase
Mol. Mass.:34867.94
Organism:Homo sapiens (Human)
Description:Recombinant human GGPPS was cloned and expressed in E. coli.
Residue:300
BDBM50113286
NameBDBM50113286
Synonyms:(1-Hydroxy-1-phosphono-undecyl)-phosphonic acid CHEMBL298852 | undecane-1-hydroxy-1,1-bisphosphonate
TypeSmall organic molecule
Emp. Form.C11H26O7P2
Mol. Mass.332.2675
SMILESCCCCCCCCCCC(O)(P(O)(O)=O)P(O)(O)=O