Reaction Details
TargetFarnesyl pyrophosphate synthase
LigandBDBM25313
Substrate/Competitorn/a
Meas. Tech.ChEMBL_69350 (CHEMBL677586)
IC50 50±n/a nM
Citation Szabo, CMMatsumura, YFukura, SMartin, MBSanders, JMSengupta, SCieslak, JALoftus, TCLea, CRLee, HJKoohang, ACoates, RMSagami, HOldfield, E Inhibition of geranylgeranyl diphosphate synthase by bisphosphonates and diphosphates: a potential route to new bone antiresorption and antiparasitic agents. J Med Chem45:2185-96 (2002) Farnesyl pyrophosphate synthase
Name:Farnesyl pyrophosphate synthase
Type:Enzyme
Mol. Mass.:48272.89
Organism:Homo sapiens (Human)
Description:P14324
Residue:419
BDBM25313
NameBDBM25313
Synonyms:(4-amino-1-hydroxy-1-phosphonobutyl)phosphonic acid CHEMBL870 | bisphosphonate, 65
TypeSmall organic molecule
Emp. Form.C4H13NO7P2
Mol. Mass.249.096
SMILESNCCCC(O)(P(O)(O)=O)P(O)(O)=O