Reaction Details
TargetGeranylgeranyl pyrophosphate synthase
LigandBDBM25285
Substrate/Competitorn/a
Meas. Tech.ChEMBL_71679 (CHEMBL681671)
IC50 920.0±n/a nM
Citation Szabo, CMMatsumura, YFukura, SMartin, MBSanders, JMSengupta, SCieslak, JALoftus, TCLea, CRLee, HJKoohang, ACoates, RMSagami, HOldfield, E Inhibition of geranylgeranyl diphosphate synthase by bisphosphonates and diphosphates: a potential route to new bone antiresorption and antiparasitic agents. J Med Chem45:2185-96 (2002) Geranylgeranyl pyrophosphate synthase
Name:Geranylgeranyl pyrophosphate synthase
Type:Homooctamer; transferase
Mol. Mass.:34867.94
Organism:Homo sapiens (Human)
Description:Recombinant human GGPPS was cloned and expressed in E. coli.
Residue:300
BDBM25285
NameBDBM25285
Synonyms:(1-hydroxy-1-phosphonododecyl)phosphonic acid bisphosphonate, 11
TypeSmall organic molecule
Emp. Form.C12H28O7P2
Mol. Mass.346.294
SMILESCCCCCCCCCCCC(O)(P(O)(O)=O)P(O)(O)=O