Reaction Details
TargetGeranylgeranyl pyrophosphate synthase
LigandBDBM25269
Substrate/Competitorn/a
Meas. Tech.ChEMBL_71679 (CHEMBL681671)
IC50 720±n/a nM
Citation Szabo, CMMatsumura, YFukura, SMartin, MBSanders, JMSengupta, SCieslak, JALoftus, TCLea, CRLee, HJKoohang, ACoates, RMSagami, HOldfield, E Inhibition of geranylgeranyl diphosphate synthase by bisphosphonates and diphosphates: a potential route to new bone antiresorption and antiparasitic agents. J Med Chem45:2185-96 (2002) Geranylgeranyl pyrophosphate synthase
Name:Geranylgeranyl pyrophosphate synthase
Type:Homooctamer; transferase
Mol. Mass.:34867.94
Organism:Homo sapiens (Human)
Description:Recombinant human GGPPS was cloned and expressed in E. coli.
Residue:300
BDBM25269
NameBDBM25269
Synonyms:(1-hydroxy-1-phosphonodecyl)phosphonic acid bisphosphonate, 23
TypeSmall organic molecule
Emp. Form.C10H24O7P2
Mol. Mass.318.2409
SMILESCCCCCCCCCC(O)(P(O)(O)=O)P(O)(O)=O