Reaction Details
TargetGeranylgeranyl pyrophosphate synthase
LigandBDBM50098389
Substrate/Competitorn/a
Meas. Tech.ChEMBL_71679 (CHEMBL681671)
IC50 220000±n/a nM
Citation Szabo, CMMatsumura, YFukura, SMartin, MBSanders, JMSengupta, SCieslak, JALoftus, TCLea, CRLee, HJKoohang, ACoates, RMSagami, HOldfield, E Inhibition of geranylgeranyl diphosphate synthase by bisphosphonates and diphosphates: a potential route to new bone antiresorption and antiparasitic agents. J Med Chem45:2185-96 (2002) Geranylgeranyl pyrophosphate synthase
Name:Geranylgeranyl pyrophosphate synthase
Type:Homooctamer; transferase
Mol. Mass.:34867.94
Organism:Homo sapiens (Human)
Description:Recombinant human GGPPS was cloned and expressed in E. coli.
Residue:300
BDBM50098389
NameBDBM50098389
Synonyms:1-hydroxy-2-(1H-imidazol-5-yl)ethane-1,1-diyldiphosphonic acid CHEMBL301247 [1-Hydroxy-2-(3H-imidazol-4-yl)-1-phosphono-ethyl]-phosphonic acid
TypeSmall organic molecule
Emp. Form.C5H10N2O7P2
Mol. Mass.272.0896
SMILESOC(Cc1cnc[nH]1)(P(O)(O)=O)P(O)(O)=O