Reaction Details
TargetD(2) dopamine receptor
LigandBDBM50113331
Substrate/Competitorn/a
Meas. Tech.ChEMBL_62095 (CHEMBL674975)
Ki 1.3±n/a nM
Citation Fu, XTan, PZKula, NSBaldessarini, RTamagnan, GInnis, RBBaldwin, RM Synthesis, receptor potency, and selectivity of halogenated diphenylpiperidines as serotonin 5-HT2A ligands for PET or SPECT brain imaging. J Med Chem45:2319-24 (2002) D(2) dopamine receptor
Name:D(2) dopamine receptor
Type:G Protein-Coupled Receptor (GPCR)
Mol. Mass.:50931.60
Organism:Rattus norvegicus (rat)
Description:P61169
Residue:444
BDBM50113331
NameBDBM50113331
Synonyms:(4-Fluoro-phenyl)-{1-[2-(2-iodo-phenyl)-ethyl]-piperidin-4-yl}-methanone | CHEMBL74756
TypeSmall organic molecule
Emp. Form.C20H21FINO
Mol. Mass.437.2897
SMILESFc1ccc(cc1)C(=O)C1CCN(CCc2ccccc2I)CC1