Reaction Details
Target5-hydroxytryptamine receptor 2A
LigandBDBM50113330
Substrate/Competitorn/a
Meas. Tech.ChEMBL_2305 (CHEMBL617090)
Ki 0.91±n/a nM
Citation Fu, XTan, PZKula, NSBaldessarini, RTamagnan, GInnis, RBBaldwin, RM Synthesis, receptor potency, and selectivity of halogenated diphenylpiperidines as serotonin 5-HT2A ligands for PET or SPECT brain imaging. J Med Chem45:2319-24 (2002) 5-hydroxytryptamine receptor 2A
Name:5-hydroxytryptamine receptor 2A
Type:undefined
Mol. Mass.:52607.65
Organism:Homo sapiens (Human)
Description:P28223
Residue:471
BDBM50113330
NameBDBM50113330
Synonyms:(4-Fluoro-phenyl)-{1-[2-(2-iodo-phenyl)-ethyl]-piperidin-4-yl}-methanol | CHEMBL77855
TypeSmall organic molecule
Emp. Form.C20H23FINO
Mol. Mass.439.3056
SMILESOC(C1CCN(CCc2ccccc2I)CC1)c1ccc(F)cc1