Reaction Details
TargetcAMP-specific 3',5'-cyclic phosphodiesterase 4A
LigandBDBM50064858
Substrate/Competitorn/a
Meas. Tech.ChEBML_155041
IC50 4±n/a nM
Citation Alexander, RPWarrellow, GJEaton, MABoyd, ECHead, JCPorter, JRBrown, JAReuberson, JTHutchinson, BTurner, PBoyce, BBarnes, DMason, BCannell, ATaylor, RJZomaya, AMillican, ALeonard, JMorphy, RWales, MPerry, MAllen, RAGozzard, NHughes, BHiggs, G CDP840. A prototype of a novel class of orally active anti-inflammatory phosphodiesterase 4 inhibitors. Bioorg Med Chem Lett12:1451-6 (2002) cAMP-specific 3',5'-cyclic phosphodiesterase 4A
Name:cAMP-specific 3',5'-cyclic phosphodiesterase 4A
Type:Enzyme
Mol. Mass.:98113.27
Organism:Homo sapiens (Human)
Description:P27815
Residue:886
BDBM50064858
NameBDBM50064858
Synonyms:(R)-4-(2-(3-(cyclopentyloxy)-4-methoxyphenyl)-2-phenylethyl)pyridine 4-[2-(3-Cyclopentyloxy-4-methoxy-phenyl)-2-phenyl-ethyl]-pyridine | CHEMBL32442
TypeSmall organic molecule
Emp. Form.C25H27NO2
Mol. Mass.373.4874
SMILESCOc1ccc(cc1OC1CCCC1)[C@H](Cc1ccncc1)c1ccccc1