Reaction Details
TargetcAMP-specific 3',5'-cyclic phosphodiesterase 4A
LigandBDBM50113373
Substrate/Competitorn/a
Meas. Tech.ChEMBL_155041 (CHEMBL765483)
Ki 1170±n/a nM
Citation Alexander, RPWarrellow, GJEaton, MABoyd, ECHead, JCPorter, JRBrown, JAReuberson, JTHutchinson, BTurner, PBoyce, BBarnes, DMason, BCannell, ATaylor, RJZomaya, AMillican, ALeonard, JMorphy, RWales, MPerry, MAllen, RAGozzard, NHughes, BHiggs, G CDP840. A prototype of a novel class of orally active anti-inflammatory phosphodiesterase 4 inhibitors. Bioorg Med Chem Lett12:1451-6 (2002) cAMP-specific 3',5'-cyclic phosphodiesterase 4A
Name:cAMP-specific 3',5'-cyclic phosphodiesterase 4A
Type:Enzyme
Mol. Mass.:98113.27
Organism:Homo sapiens (Human)
Description:P27815
Residue:886
BDBM50113373
NameBDBM50113373
Synonyms:2-Cyclopentyloxy-4-(1,2-diphenyl-ethyl)-1-methoxy-benzene | CHEMBL33535
TypeSmall organic molecule
Emp. Form.C26H28O2
Mol. Mass.372.4993
SMILESCOc1ccc(cc1OC1CCCC1)C(Cc1ccccc1)c1ccccc1