Reaction Details
TargetCoagulation factor X
LigandBDBM50113598
Substrate/Competitorn/a
Meas. Tech.ChEMBL_69679 (CHEMBL682017)
IC50 0.740000±n/a nM
Citation Song, YClizbe, LBhakta, CTeng, WLi, WWu, YJia, ZJZhang, PWang, LDoughan, BSu, TKanter, JWoolfrey, JWong, PHuang, BTran, KSinha, UPark, GReed, AMalinowski, JHollenbach, SScarborough, RMZhu, BY Design, synthesis, and SAR of substituted acrylamides as factor Xa inhibitors. Bioorg Med Chem Lett12:1511-5 (2002) Coagulation factor X
Name:Coagulation factor X
Type:Enzyme
Mol. Mass.:54726.60
Organism:Homo sapiens (Human)
Description:n/a
Residue:488
BDBM50113598
NameBDBM50113598
Synonyms:(Z)-3-(3-Carbamimidoyl-4-fluoro-phenyl)-2-fluoro-but-2-enoic acid (3-chloro-2'-sulfamoyl-biphenyl-4-yl)-amide | CHEMBL39297
TypeSmall organic molecule
Emp. Form.C23H19ClF2N4O3S
Mol. Mass.504.937
SMILESC\C(=C(/F)C(=O)Nc1ccc(cc1Cl)-c1ccccc1S(N)(=O)=O)c1ccc(F)c(c1)C(N)=N