Reaction Details
TargetCathepsin K
LigandBDBM50113662
Substrate/Competitorn/a
Meas. Tech.ChEMBL_48344 (CHEMBL663333)
Ki 11±n/a nM
Citation Altmann, ERenaud, JGreen, JFarley, DCutting, BJahnke, W Arylaminoethyl amides as novel non-covalent cathepsin K inhibitors. J Med Chem45:2352-4 (2002) Cathepsin K
Name:Cathepsin K
Type:Enzyme
Mol. Mass.:36975.68
Organism:Homo sapiens (Human)
Description:P43235
Residue:329
BDBM50113662
NameBDBM50113662
Synonyms:1-(2,3-Dichloro-phenyl)-1H-[1,2,4]triazole-3-carboxylic acid {1-[2-(4-methoxy-phenylamino)-ethylcarbamoyl]-3-methyl-butyl}-amide | CHEMBL80508
TypeSmall organic molecule
Emp. Form.C24H28Cl2N6O3
Mol. Mass.519.424
SMILESCOc1ccc(NCCNC(=O)[C@H](CC(C)C)NC(=O)c2ncn(n2)-c2cccc(Cl)c2Cl)cc1