Reaction Details
TargetCyclin-dependent kinase 4/G1/S-specific cyclin-D1
LigandBDBM50113679
Substrate/Competitorn/a
Meas. Tech.ChEMBL_52501 (CHEMBL665124)
IC50 200000±n/a nM
Citation Naumann, TMatter, H Structural classification of protein kinases using 3D molecular interaction field analysis of their ligand binding sites: target family landscapes. J Med Chem45:2366-78 (2002) Cyclin-dependent kinase 4/G1/S-specific cyclin-D1
Name:Cyclin-dependent kinase 4/G1/S-specific cyclin-D1
Type:Protein Complex
Mol. Mass.:n/a
Description:CDK4/D1 complexes were purified from insect cells co-infected with baculovirus vectors containing each of the components.
Components:This complex has 2 components.
Component 1
Name:Cyclin-dependent kinase 4
Synonyms:CDK4 Cell division protein kinase 4 PSK-J3
Type:Enzyme Subunit
Mol. Mass.:33731.96
Organism:Homo sapiens (Human)
Description:P11802
Residue:303
Component 2
Name:G1/S-specific cyclin-D1
Synonyms:B-cell lymphoma 1 protein BCL-1 oncogene CCND1 PRAD1 | PRAD1 oncogene
Type:Enzyme Subunit
Mol. Mass.:33717.70
Organism:Homo sapiens (Human)
Description:n/a
Residue:295
BDBM50113679
NameBDBM50113679
Synonyms:9-Isopropyl-N*6*-(3-methyl-but-2-enyl)-9H-purine-2,6-diamine | CHEMBL77155
TypeSmall organic molecule
Emp. Form.C13H20N6
Mol. Mass.260.3381
SMILES[#6]-[#6](-[#6])-n1cnc2c(-[#7]-[#6]\[#6]=[#6](/[#6])-[#6])nc(-[#7])nc12