Reaction Details
TargetCyclin-dependent kinase 1
LigandBDBM50113684
Substrate/Competitorn/a
Meas. Tech.ChEMBL_50316 (CHEMBL661621)
IC50 80000±n/a nM
Citation Naumann, TMatter, H Structural classification of protein kinases using 3D molecular interaction field analysis of their ligand binding sites: target family landscapes. J Med Chem45:2366-78 (2002) Cyclin-dependent kinase 1
Name:Cyclin-dependent kinase 1
Type:Enzyme Subunit
Mol. Mass.:34101.08
Organism:Homo sapiens (Human)
Description:P06493
Residue:297
BDBM50113684
NameBDBM50113684
Synonyms:2-[6-(4-Chloro-phenylamino)-9-isopropyl-9H-purin-2-ylamino]-3-methyl-butan-1-ol | CHEMBL77262
TypeSmall organic molecule
Emp. Form.C19H25ClN6O
Mol. Mass.388.894
SMILESCC(C)[C@H](CO)Nc1nc(Nc2ccc(Cl)cc2)c2ncn(C(C)C)c2n1