Reaction Details
TargetCyclin-dependent kinase 1
LigandBDBM50113689
Substrate/Competitorn/a
Meas. Tech.ChEMBL_50316 (CHEMBL661621)
IC50 4300000±n/a nM
Citation Naumann, TMatter, H Structural classification of protein kinases using 3D molecular interaction field analysis of their ligand binding sites: target family landscapes. J Med Chem45:2366-78 (2002) Cyclin-dependent kinase 1
Name:Cyclin-dependent kinase 1
Type:Enzyme Subunit
Mol. Mass.:34101.08
Organism:Homo sapiens (Human)
Description:P06493
Residue:297
BDBM50113689
NameBDBM50113689
Synonyms:2-[6-(2-Chloro-phenylamino)-9-isopropyl-9H-purin-2-ylamino]-ethanol | CHEMBL307367
TypeSmall organic molecule
Emp. Form.C16H19ClN6O
Mol. Mass.346.815
SMILESCC(C)n1cnc2c(Nc3ccccc3Cl)nc(NCCO)nc12