Reaction Details
TargetCyclin-dependent kinase 1
LigandBDBM50102704
Substrate/Competitorn/a
Meas. Tech.ChEMBL_50316 (CHEMBL661621)
IC50 10800000±n/a nM
Citation Naumann, TMatter, H Structural classification of protein kinases using 3D molecular interaction field analysis of their ligand binding sites: target family landscapes. J Med Chem45:2366-78 (2002) Cyclin-dependent kinase 1
Name:Cyclin-dependent kinase 1
Type:Enzyme Subunit
Mol. Mass.:34101.08
Organism:Homo sapiens (Human)
Description:P06493
Residue:297
BDBM50102704
NameBDBM50102704
Synonyms:CHEMBL76921 [9-Isopropyl-2-(4-methyl-piperazin-1-yl)-9H-purin-6-yl]-(4-methoxy-benzyl)-amine(NG13)
TypeSmall organic molecule
Emp. Form.C21H29N7O
Mol. Mass.395.5013
SMILESCOc1ccc(CNc2nc(nc3n(cnc23)C(C)C)N2CCN(C)CC2)cc1