Reaction Details
TargetCyclin-dependent kinase 1
LigandBDBM50113695
Substrate/Competitorn/a
Meas. Tech.ChEMBL_50316 (CHEMBL661621)
IC50 1000000±n/a nM
Citation Naumann, TMatter, H Structural classification of protein kinases using 3D molecular interaction field analysis of their ligand binding sites: target family landscapes. J Med Chem45:2366-78 (2002) Cyclin-dependent kinase 1
Name:Cyclin-dependent kinase 1
Type:Enzyme Subunit
Mol. Mass.:34101.08
Organism:Homo sapiens (Human)
Description:P06493
Residue:297
BDBM50113695
NameBDBM50113695
Synonyms:2-{[9-Isopropyl-6-(4-methoxy-benzylamino)-9H-purin-2-yl]-methyl-amino}-1-phenyl-ethanol | CHEMBL80562
TypeSmall organic molecule
Emp. Form.C25H30N6O2
Mol. Mass.446.5447
SMILESCOc1ccc(CNc2nc(nc3n(cnc23)C(C)C)N(C)CC(O)c2ccccc2)cc1