Reaction Details
TargetCyclin-dependent kinase 1
LigandBDBM50113708
Substrate/Competitorn/a
Meas. Tech.ChEMBL_50316 (CHEMBL661621)
IC50 3000000±n/a nM
Citation Naumann, TMatter, H Structural classification of protein kinases using 3D molecular interaction field analysis of their ligand binding sites: target family landscapes. J Med Chem45:2366-78 (2002) Cyclin-dependent kinase 1
Name:Cyclin-dependent kinase 1
Type:Enzyme Subunit
Mol. Mass.:34101.08
Organism:Homo sapiens (Human)
Description:P06493
Residue:297
BDBM50113708
NameBDBM50113708
Synonyms:2-{1-[9-Isopropyl-6-(2-trifluoromethyl-benzylamino)-9H-purin-2-yl]-piperidin-2-yl}-ethanol | CHEMBL77291
TypeSmall organic molecule
Emp. Form.C23H29F3N6O
Mol. Mass.462.5112
SMILESCC(C)n1cnc2c(NCc3ccccc3C(F)(F)F)nc(nc12)N1CCCCC1CCO