Reaction Details
TargetCyclin-dependent kinase 1
LigandBDBM50113715
Substrate/Competitorn/a
Meas. Tech.ChEMBL_50316 (CHEMBL661621)
IC50 4400000±n/a nM
Citation Naumann, TMatter, H Structural classification of protein kinases using 3D molecular interaction field analysis of their ligand binding sites: target family landscapes. J Med Chem45:2366-78 (2002) Cyclin-dependent kinase 1
Name:Cyclin-dependent kinase 1
Type:Enzyme Subunit
Mol. Mass.:34101.08
Organism:Homo sapiens (Human)
Description:P06493
Residue:297
BDBM50113715
NameBDBM50113715
Synonyms:CHEMBL309495 | N*6*-(3-Chloro-phenyl)-N*2*-(2-dimethylamino-ethyl)-9-isopropyl-9H-purine-2,6-diamine
TypeSmall organic molecule
Emp. Form.C18H24ClN7
Mol. Mass.373.883
SMILESCC(C)n1cnc2c(Nc3cccc(Cl)c3)nc(NCCN(C)C)nc12