Reaction Details
TargetCyclin-dependent kinase 1
LigandBDBM50102697
Substrate/Competitorn/a
Meas. Tech.ChEMBL_50316 (CHEMBL661621)
IC50 4000000±n/a nM
Citation Naumann, TMatter, H Structural classification of protein kinases using 3D molecular interaction field analysis of their ligand binding sites: target family landscapes. J Med Chem45:2366-78 (2002) Cyclin-dependent kinase 1
Name:Cyclin-dependent kinase 1
Type:Enzyme Subunit
Mol. Mass.:34101.08
Organism:Homo sapiens (Human)
Description:P06493
Residue:297
BDBM50102697
NameBDBM50102697
Synonyms:(2-Azepan-1-yl-9-isopropyl-9H-purin-6-yl)-(4-methoxy-benzyl)-amine CHEMBL76784
TypeSmall organic molecule
Emp. Form.C22H30N6O
Mol. Mass.394.5132
SMILESCOc1ccc(CNc2nc(nc3n(cnc23)C(C)C)N2CCCCCC2)cc1