Reaction Details
TargetCyclin-dependent kinase 1
LigandBDBM50113716
Substrate/Competitorn/a
Meas. Tech.ChEMBL_50316 (CHEMBL661621)
IC50 430000000±n/a nM
Citation Naumann, TMatter, H Structural classification of protein kinases using 3D molecular interaction field analysis of their ligand binding sites: target family landscapes. J Med Chem45:2366-78 (2002) Cyclin-dependent kinase 1
Name:Cyclin-dependent kinase 1
Type:Enzyme Subunit
Mol. Mass.:34101.08
Organism:Homo sapiens (Human)
Description:P06493
Residue:297
BDBM50113716
NameBDBM50113716
Synonyms:2-[9-Isopropyl-6-(naphthalen-2-ylamino)-9H-purin-2-ylamino]-ethanol | CHEMBL80168
TypeSmall organic molecule
Emp. Form.C20H22N6O
Mol. Mass.362.4283
SMILESCC(C)n1cnc2c(Nc3ccc4ccccc4c3)nc(NCCO)nc12