Reaction Details
TargetCyclin-dependent kinase 1
LigandBDBM50113720
Substrate/Competitorn/a
Meas. Tech.ChEMBL_50316 (CHEMBL661621)
IC50 450000±n/a nM
Citation Naumann, TMatter, H Structural classification of protein kinases using 3D molecular interaction field analysis of their ligand binding sites: target family landscapes. J Med Chem45:2366-78 (2002) Cyclin-dependent kinase 1
Name:Cyclin-dependent kinase 1
Type:Enzyme Subunit
Mol. Mass.:34101.08
Organism:Homo sapiens (Human)
Description:P06493
Residue:297
BDBM50113720
NameBDBM50113720
Synonyms:CHEMBL306183 | {1-[9-Isopropyl-6-(4-methoxy-benzylamino)-9H-purin-2-ylamino]-cyclopentyl}-methanol
TypeSmall organic molecule
Emp. Form.C22H30N6O2
Mol. Mass.410.5126
SMILESCOc1ccc(CNc2nc(NC3(CO)CCCC3)nc3n(cnc23)C(C)C)cc1