Reaction Details
TargetCyclin-dependent kinase 1
LigandBDBM50113719
Substrate/Competitorn/a
Meas. Tech.ChEMBL_50316 (CHEMBL661621)
IC50 9000000±n/a nM
Citation Naumann, TMatter, H Structural classification of protein kinases using 3D molecular interaction field analysis of their ligand binding sites: target family landscapes. J Med Chem45:2366-78 (2002) Cyclin-dependent kinase 1
Name:Cyclin-dependent kinase 1
Type:Enzyme Subunit
Mol. Mass.:34101.08
Organism:Homo sapiens (Human)
Description:P06493
Residue:297
BDBM50113719
NameBDBM50113719
Synonyms:2-{1-[6-(3,3-Diphenyl-propylamino)-9-isopropyl-9H-purin-2-yl]-piperidin-2-yl}-ethanol | CHEMBL80758
TypeSmall organic molecule
Emp. Form.C30H38N6O
Mol. Mass.498.6623
SMILESCC(C)n1cnc2c(NCCC(c3ccccc3)c3ccccc3)nc(nc12)N1CCCCC1CCO