Reaction Details
TargetCyclin-dependent kinase 1
LigandBDBM50113725
Substrate/Competitorn/a
Meas. Tech.ChEMBL_50316 (CHEMBL661621)
IC50 30000±n/a nM
Citation Naumann, TMatter, H Structural classification of protein kinases using 3D molecular interaction field analysis of their ligand binding sites: target family landscapes. J Med Chem45:2366-78 (2002) Cyclin-dependent kinase 1
Name:Cyclin-dependent kinase 1
Type:Enzyme Subunit
Mol. Mass.:34101.08
Organism:Homo sapiens (Human)
Description:P06493
Residue:297
BDBM50113725
NameBDBM50113725
Synonyms:2-Chloro-5-[2-(1-hydroxymethyl-2-methyl-propylamino)-9-isopropyl-9H-purin-6-ylamino]-benzoic acid | CHEMBL78223
TypeSmall organic molecule
Emp. Form.C20H25ClN6O3
Mol. Mass.432.904
SMILESCC(C)[C@H](CO)Nc1nc(Nc2ccc(Cl)c(c2)C(O)=O)c2ncn(C(C)C)c2n1