Reaction Details
TargetCyclin-dependent kinase 1
LigandBDBM50113726
Substrate/Competitorn/a
Meas. Tech.ChEMBL_50316 (CHEMBL661621)
IC50 230000±n/a nM
Citation Naumann, TMatter, H Structural classification of protein kinases using 3D molecular interaction field analysis of their ligand binding sites: target family landscapes. J Med Chem45:2366-78 (2002) Cyclin-dependent kinase 1
Name:Cyclin-dependent kinase 1
Type:Enzyme Subunit
Mol. Mass.:34101.08
Organism:Homo sapiens (Human)
Description:P06493
Residue:297
BDBM50113726
NameBDBM50113726
Synonyms:2-{1-[6-(4-Amino-benzylamino)-9-isopropyl-9H-purin-2-yl]-piperidin-2-yl}-ethanol | CHEMBL310271
TypeSmall organic molecule
Emp. Form.C22H31N7O
Mol. Mass.409.5278
SMILESCC(C)n1cnc2c(NCc3ccc(N)cc3)nc(nc12)N1CCCCC1CCO